Target
Gag-Pol polyprotein
Ligand
BDBM567121
Substrate
Meas. Tech.
Anti-HIV-1 Activity Test
EC50
3.00±n/a nM
Citation
 He, YZhang, HZheng, YZhang, YTang, CDing, WYang, LLi, Y DACOS type NNRTIS amino acid ester derivative, preparation method thereof, pharmaceutical composition, and application thereof US Patent  US11420959 Publication Date 8/23/2022 
Target
Name:
Gag-Pol polyprotein
Synonyms:
POL_HV1LW gag-pol
Type:
Protein
Mol. Mass.:
162115.08
Organism:
HIV-1
Description:
P0C6F2
Residue:
1435
  
Inhibitor
Name:
BDBM567121
Synonyms:
US11420959, Example I-20
Type:
Small organic molecule
Emp. Form.:
C27H37N3O4S2
Mol. Mass.:
531.73
SMILES:
CSCCC(N)C(=O)Oc1ccc(cc1)C(=O)CSc1nc(CC2CCCCC2)c(C(C)C)c(=O)[nH]1
: