Target
Kelch-like ECH-associated protein 1 [321-624]
Ligand
BDBM486661
Substrate
Meas. Tech.
Fluorescence Based Assay
Kd
1.10±n/a nM
Citation
 Barbay, JKChai, WHirst, GCKreutter, KDKummer, DAMcClure, KJNishimura, RTShih, AYVenable, JDVenkatesan, HWei, J Inhibitors of KEAP1-Nrf2 protein-protein interaction US Patent  US11427601 Publication Date 8/30/2022
Target
Name:
Kelch-like ECH-associated protein 1 [321-624]
Synonyms:
KEAP1 Kelch-like ECH-associated protein 1 (KEAP1)(321-624)
Type:
Enzyme Catalytic Domain
Mol. Mass.:
33399.63
Organism:
Homo sapiens (Human)
Description:
aa 321-624
Residue:
304
  
Inhibitor
Name:
BDBM486661
Synonyms:
US10947252, Example 96 | US11427601, Example 96
Type:
Small organic molecule
Emp. Form.:
C28H24ClF3N4O6S
Mol. Mass.:
637.027
SMILES:
Cc1c(ccn2c(nnc12)C(F)(F)F)[C@H](CC(O)=O)c1ccc(Cl)c(CN2CC3(COC3)Oc3ccccc3S2(=O)=O)c1
: