Target
Kelch-like ECH-associated protein 1 [321-624]
Ligand
BDBM486672
Substrate
Meas. Tech.
Fluorescence Based Assay
Kd
<1.000±n/a nM
Citation
 Barbay, JKChai, WHirst, GCKreutter, KDKummer, DAMcClure, KJNishimura, RTShih, AYVenable, JDVenkatesan, HWei, J Inhibitors of KEAP1-Nrf2 protein-protein interaction US Patent  US11427601 Publication Date 8/30/2022
Target
Name:
Kelch-like ECH-associated protein 1 [321-624]
Synonyms:
KEAP1 Kelch-like ECH-associated protein 1 (KEAP1)(321-624)
Type:
Enzyme Catalytic Domain
Mol. Mass.:
33399.63
Organism:
Homo sapiens (Human)
Description:
aa 321-624
Residue:
304
  
Inhibitor
Name:
BDBM486672
Synonyms:
US10947252, Example 110 | US11427601, Example 110
Type:
Small organic molecule
Emp. Form.:
C31H33F3N6O6S
Mol. Mass.:
674.691
SMILES:
CN(CCO)c1ccc2c(OC3(CC3)CN(Cc3cc(ccc3C)[C@H](CC(O)=O)c3ccn4c(nnc4c3C)C(F)(F)F)S2(=O)=O)n1
: