Target
Envelope glycoprotein
Ligand
BDBM574753
Substrate
Meas. Tech.
Inhibition of Authentic Filovirus Infections in Cell Culture Assays
IC50
2700±n/a nM
Citation
 Bowlin, TLMoir, DTChandran, KDye, Jr., JMWilliams, JDAron, ZDBarbor, JPLively, KNNash, PJMills, DMBasu, A Broad spectrum inhibitors of filoviruses US Patent  US11459308 Publication Date 10/4/2022 
Target
Name:
Envelope glycoprotein
Synonyms:
GP VGP_EBOZ5
Type:
Protein
Mol. Mass.:
74450.60
Organism:
ZEBOV
Description:
P87666
Residue:
676
  
Inhibitor
Name:
BDBM574753
Synonyms:
US11459308, Compound 3580 | US11459308, Compound 3586
Type:
Small organic molecule
Emp. Form.:
C23H26N4
Mol. Mass.:
358.4793
SMILES:
CN1CCN(CC1)c1ccnc(NC(c2ccccc2)c2ccccc2)c1
: