Target
Envelope glycoprotein
Ligand
BDBM574768
Substrate
Meas. Tech.
Inhibition of Authentic Filovirus Infections in Cell Culture Assays
IC50
>20000±n/a nM
Citation
 Bowlin, TLMoir, DTChandran, KDye, Jr., JMWilliams, JDAron, ZDBarbor, JPLively, KNNash, PJMills, DMBasu, A Broad spectrum inhibitors of filoviruses US Patent  US11459308 Publication Date 10/4/2022 
Target
Name:
Envelope glycoprotein
Synonyms:
GP VGP_EBOZ5
Type:
Protein
Mol. Mass.:
74450.60
Organism:
ZEBOV
Description:
P87666
Residue:
676
  
Inhibitor
Name:
BDBM574768
Synonyms:
US11459308, Compound 3575
Type:
Small organic molecule
Emp. Form.:
C28H28N4O2S
Mol. Mass.:
484.613
SMILES:
[O-][N+](=O)c1ccc(cc1NC(c1ccccc1)c1ccccc1)N1CCN(Cc2cccs2)CC1
: