Target
Envelope glycoprotein
Ligand
BDBM574776
Substrate
Meas. Tech.
Inhibition of Infectivity of Recombinant VSVs Expressing Glycoproteins from Zaire Ebolavirus, Sudan Ebolavirus, Bundybugyo Ebolavirus, and Lassa Arenavirus
IC50
<100.0±n/a nM
Citation
 Bowlin, TLMoir, DTChandran, KDye, Jr., JMWilliams, JDAron, ZDBarbor, JPLively, KNNash, PJMills, DMBasu, A Broad spectrum inhibitors of filoviruses US Patent  US11459308 Publication Date 10/4/2022 
Target
Name:
Envelope glycoprotein
Synonyms:
GP VGP_EBORS | rVSV-EBOV
Type:
Protein
Mol. Mass.:
74522.01
Organism:
REBOV
Description:
Q89853
Residue:
677
  
Inhibitor
Name:
BDBM574776
Synonyms:
US11459308, Compound 3700
Type:
Small organic molecule
Emp. Form.:
C24H25N3O3
Mol. Mass.:
403.4736
SMILES:
[O-][N+](=O)c1ccc(cc1NC(c1ccccc1)c1ccccc1)N1CCCOCC1
: