Target
Envelope glycoprotein
Ligand
BDBM574784
Substrate
Meas. Tech.
Inhibition of Authentic Filovirus Infections in Cell Culture Assays
IC50
820±n/a nM
Citation
 Bowlin, TLMoir, DTChandran, KDye, Jr., JMWilliams, JDAron, ZDBarbor, JPLively, KNNash, PJMills, DMBasu, A Broad spectrum inhibitors of filoviruses US Patent  US11459308 Publication Date 10/4/2022 
Target
Name:
Envelope glycoprotein
Synonyms:
GP VGP_EBOZ5
Type:
Protein
Mol. Mass.:
74450.60
Organism:
ZEBOV
Description:
P87666
Residue:
676
  
Inhibitor
Name:
BDBM574784
Synonyms:
US11459308, Compound 4329 | US11459308, Compound 4334
Type:
Small organic molecule
Emp. Form.:
C23H26N4O2
Mol. Mass.:
390.4781
SMILES:
CN(C)CCNc1ccc(c(NC(c2ccccc2)c2ccccc2)c1)[N+]([O-])=O
: