Target
Envelope glycoprotein
Ligand
BDBM574803
Substrate
Meas. Tech.
Inhibition of Authentic Filovirus Infections in Cell Culture Assays
IC50
3000±n/a nM
Citation
 Bowlin, TLMoir, DTChandran, KDye, Jr., JMWilliams, JDAron, ZDBarbor, JPLively, KNNash, PJMills, DMBasu, A Broad spectrum inhibitors of filoviruses US Patent  US11459308 Publication Date 10/4/2022 
Target
Name:
Envelope glycoprotein
Synonyms:
GP VGP_EBOZ5
Type:
Protein
Mol. Mass.:
74450.60
Organism:
ZEBOV
Description:
P87666
Residue:
676
  
Inhibitor
Name:
BDBM574803
Synonyms:
US11459308, Compound 3634
Type:
Small organic molecule
Emp. Form.:
C25H28N4O3
Mol. Mass.:
432.5148
SMILES:
COc1ccccc1C(Nc1cc(ccc1[N+]([O-])=O)N1CCN(C)CC1)c1ccccc1
: