Target
Envelope glycoprotein
Ligand
BDBM574821
Substrate
Meas. Tech.
Inhibition of Infectivity of Recombinant VSVs Expressing Glycoproteins from Zaire Ebolavirus, Sudan Ebolavirus, Bundybugyo Ebolavirus, and Lassa Arenavirus
IC50
1600±n/a nM
Citation
 Bowlin, TLMoir, DTChandran, KDye, Jr., JMWilliams, JDAron, ZDBarbor, JPLively, KNNash, PJMills, DMBasu, A Broad spectrum inhibitors of filoviruses US Patent  US11459308 Publication Date 10/4/2022 
Target
Name:
Envelope glycoprotein
Synonyms:
GP VGP_EBORS | rVSV-EBOV
Type:
Protein
Mol. Mass.:
74522.01
Organism:
REBOV
Description:
Q89853
Residue:
677
  
Inhibitor
Name:
BDBM574821
Synonyms:
US11459308, Compound 4210
Type:
Small organic molecule
Emp. Form.:
C28H30N4
Mol. Mass.:
422.5646
SMILES:
C1CCN2CCN(CC2C1)c1ccc2ncn(C(c3ccccc3)c3ccccc3)c2c1
: