Target
Transmembrane anterior posterior transformation protein 1 homolog
Ligand
BDBM574849
Substrate
Meas. Tech.
Assessing Antiviral Activity Against Human Cytomegalovirus (HCMV)
IC50
758±n/a nM
Citation
 Remiszewski, SChiang, LWMurphy, EASun, QKayser, FFink, SJ Broad spectrum antiviral compositions and methods US Patent  US11459321 Publication Date 10/4/2022 
Target
Name:
Transmembrane anterior posterior transformation protein 1 homolog
Synonyms:
CMVFR TAPT1 | TAPT1_HUMAN
Type:
Protein
Mol. Mass.:
64270.48
Organism:
Human
Description:
Q6NXT6
Residue:
567
  
Inhibitor
Name:
BDBM574849
Synonyms:
US11459321, Example 4
Type:
Small organic molecule
Emp. Form.:
C24H21N7S
Mol. Mass.:
439.535
SMILES:
C(c1cnc(s1)N1CCc2ccc(cc2C1)-c1c[nH]nn1)c1cccc(c1)-n1cccn1
: