Target
Transmembrane anterior posterior transformation protein 1 homolog
Ligand
BDBM575070
Substrate
Meas. Tech.
Assessing Antiviral Activity Against Human Cytomegalovirus (HCMV)
IC50
748±n/a nM
Citation
 Remiszewski, SChiang, LWMurphy, EASun, QKayser, FFink, SJ Broad spectrum antiviral compositions and methods US Patent  US11459321 Publication Date 10/4/2022 
Target
Name:
Transmembrane anterior posterior transformation protein 1 homolog
Synonyms:
CMVFR TAPT1 | TAPT1_HUMAN
Type:
Protein
Mol. Mass.:
64270.48
Organism:
Human
Description:
Q6NXT6
Residue:
567
  
Inhibitor
Name:
BDBM575070
Synonyms:
US11459321, Example 17
Type:
Small organic molecule
Emp. Form.:
C25H22N6S
Mol. Mass.:
438.547
SMILES:
C(c1cnc(s1)N1CCc2ccc(cc2C1)-n1ccnc1)c1ccc(cc1)-n1ccnc1
: