Target
Transmembrane anterior posterior transformation protein 1 homolog
Ligand
BDBM575088
Substrate
Meas. Tech.
Assessing Antiviral Activity Against Human Cytomegalovirus (HCMV)
IC50
633±n/a nM
Citation
 Remiszewski, SChiang, LWMurphy, EASun, QKayser, FFink, SJ Broad spectrum antiviral compositions and methods US Patent  US11459321 Publication Date 10/4/2022 
Target
Name:
Transmembrane anterior posterior transformation protein 1 homolog
Synonyms:
CMVFR TAPT1 | TAPT1_HUMAN
Type:
Protein
Mol. Mass.:
64270.48
Organism:
Human
Description:
Q6NXT6
Residue:
567
  
Inhibitor
Name:
BDBM575088
Synonyms:
US11459321, Example 34
Type:
Small organic molecule
Emp. Form.:
C23H23N3O4S2
Mol. Mass.:
469.576
SMILES:
CS(=O)(=O)c1cccc(Cc2cnc(s2)N2CCc3ccc(cc3C2)N2CCOC2=O)c1
: