Target
Orexin receptor type 2
Ligand
BDBM576216
Substrate
Meas. Tech.
IPOne assay
EC50
6.60±n/a nM
Citation
 A., AKIrina, CMM., HDC., KJJian, LJ., MPL., RVT., RMA., SCZhe, WDong, X MACROCYCLIC UREA OREXIN RECEPTOR AGONISTS WIPO 0:0 (2022) Target
Name:
Orexin receptor type 2
Synonyms:
HCRTR2 OX2R_HUMAN Orexin receptor type 2 (OR-2) Orexin receptor type 2 (OX2R) Ox-2-R | Ox2-R
Type:
Protein
Mol. Mass.:
50710.53
Organism:
Homo sapiens (Human)
Description:
O43614
Residue:
444
  
Inhibitor
Name:
BDBM576216
Synonyms:
WO2022094012, Example 19B
Type:
Small organic molecule
Emp. Form.:
C26H30N6O2S
Mol. Mass.:
490.62
SMILES:
CCN1[C@H](C)c2cccc(c2)-c2cn3ccnc3c(OCCCCC[C@@H](NC1=O)c1cscn1)n2
: