Target
Orexin receptor type 2
Ligand
BDBM576217
Substrate
Meas. Tech.
IPOne assay
EC50
9.50±n/a nM
Citation
 A., AKIrina, CMM., HDC., KJJian, LJ., MPL., RVT., RMA., SCZhe, WDong, X MACROCYCLIC UREA OREXIN RECEPTOR AGONISTS WIPO 0:0 (2022) Target
Name:
Orexin receptor type 2
Synonyms:
HCRTR2 OX2R_HUMAN Orexin receptor type 2 (OR-2) Orexin receptor type 2 (OX2R) Ox-2-R | Ox2-R
Type:
Protein
Mol. Mass.:
50710.53
Organism:
Homo sapiens (Human)
Description:
O43614
Residue:
444
  
Inhibitor
Name:
BDBM576217
Synonyms:
WO2022094012, Example 20
Type:
Small organic molecule
Emp. Form.:
C26H30N6O3
Mol. Mass.:
474.5548
SMILES:
CCN1[C@H](C)c2cccc(c2)-c2cn3ccnc3c(OCCCCCC(NC1=O)c1ccon1)n2
: