Target
Non-receptor tyrosine-protein kinase TYK2 [556-871]
Ligand
BDBM576244
Substrate
Meas. Tech.
Probe Displacement Assay
IC50
1.00±n/a nM
Citation
 Tami, MDale, RBrock, SJocelyn, W INHIBITION OF TYK2 DEPENDENT SIGNALING PATHWAYS WIPO 0:0 (2022) Target
Name:
Non-receptor tyrosine-protein kinase TYK2 [556-871]
Synonyms:
TYK2 | TYK2_HUMAN
Type:
Protein
Mol. Mass.:
35197.67
Organism:
Homo sapiens (Human)
Description:
P29597[556-871]
Residue:
316
  
Inhibitor
Name:
BDBM576244
Synonyms:
WO2022109580, Example 3
Type:
Small organic molecule
Emp. Form.:
C21H21N7O4
Mol. Mass.:
435.4359
SMILES:
CO[C@]1(CCOC1)c1cc(C)cc(n1)-n1nc(-c2cnoc2)c2cnc(NC(N)=O)cc12
: