Target
External core antigen
Ligand
BDBM576343
Substrate
Meas. Tech.
PHH Natural Infection Assay
IC50
1772±n/a nM
Citation
 Hongying, YBo, ZXiufang, Z AROMATIC BRIDGED RING AMIDE DERIVATIVES FOR THE TREATMENT AND PROPHYLAXIS OF HEPATITIS B VIRUS INFECTION WIPO 0:0 (2022) Target
Name:
External core antigen
Synonyms:
C HBeAg p25
Type:
Protein
Mol. Mass.:
24103.68
Organism:
HBVgbn
Description:
P89951
Residue:
212
  
Inhibitor
Name:
BDBM576343
Synonyms:
WO2022112205, Example 1 | WO2022112205, Example 9
Type:
Small organic molecule
Emp. Form.:
C18H15ClN2O5S
Mol. Mass.:
406.84
SMILES:
CS(=O)(=O)c1ccc(o1)C(=O)NC12CC(C1)(C2)c1nc2cc(Cl)ccc2o1
: