Target
External core antigen
Ligand
BDBM576350
Substrate
Meas. Tech.
PHH Natural Infection Assay
IC50
1370±n/a nM
Citation
 Hongying, YBo, ZXiufang, Z AROMATIC BRIDGED RING AMIDE DERIVATIVES FOR THE TREATMENT AND PROPHYLAXIS OF HEPATITIS B VIRUS INFECTION WIPO 0:0 (2022) Target
Name:
External core antigen
Synonyms:
C HBeAg p25
Type:
Protein
Mol. Mass.:
24103.68
Organism:
HBVgbn
Description:
P89951
Residue:
212
  
Inhibitor
Name:
BDBM576350
Synonyms:
WO2022112205, Example 6
Type:
Small organic molecule
Emp. Form.:
C21H19ClN2O4S
Mol. Mass.:
430.905
SMILES:
Clc1ccc2oc(nc2c1)C12CC(C1)(C2)NC(=O)c1ccc(o1)S(=O)CC1CC1
: