Target
Ceramide glucosyltransferase
Ligand
BDBM576427
Substrate
Meas. Tech.
UDP-Glo Glucosylceramide Synthase Biochemical Assay
EC50
260±n/a nM
Citation
 J., BME., FMMarie, LHJ., MJJ., RAM., SKJ., SS MODIFIED ISOINDOLINONES AS GLUCOSYLCERAMIDE SYNTHASE INHIBITORS WIPO 0:0 (2022) Target
Name:
Ceramide glucosyltransferase
Synonyms:
CEGT_HUMAN GLCT-1 UDP-glucose ceramide glucosyltransferase UGCG
Type:
PROTEIN
Mol. Mass.:
44859.25
Organism:
Homo sapiens (Human)
Description:
ChEMBL_1435474
Residue:
394
  
Inhibitor
Name:
BDBM576427
Synonyms:
WO2022115301, Example 13
Type:
Small organic molecule
Emp. Form.:
C24H27N3O3
Mol. Mass.:
405.4895
SMILES:
CC1=NNC(O1)c1cccc(c1)-c1cccc2CN([C@H](C3CC3)C(C)(C)O)C(=O)c12
: