Target
Cannabinoid receptor 2
Ligand
BDBM50288371
Substrate
Meas. Tech.
Presto-Tango -Arrestin Recruitment Assay
EC50
0.080±n/a nM
Citation
 Das, ARoy, J Docosahexaenoic acid endocannabinoid epoxide derivative compositions US Patent  US11472787 Publication Date 10/18/2022 
Target
Name:
Cannabinoid receptor 2
Synonyms:
CANNABINOID CB2 CB2 CB2B CNR2_HUMAN Cannabinoid CB2 receptor Cannabinoid receptor 2 (CB2R) | hCB2
Type:
G Protein-Coupled Receptor (GPCR)
Mol. Mass.:
39690.94
Organism:
Homo sapiens (Human)
Description:
P34972
Residue:
360
  
Inhibitor
Name:
BDBM50288371
Synonyms:
CHEMBL4177060 | US11472787, Compound 10,11-EDP-IA
Type:
Small organic molecule
Emp. Form.:
C25H39NO3
Mol. Mass.:
401.5821
SMILES:
CC\C=C/C\C=C/C\C=C/CC1OC1C\C=C/C\C=C/CCC(=O)NC(C)CO
: