Target
Protein-glutamine gamma-glutamyltransferase 6
Ligand
BDBM577483
Substrate
Meas. Tech.
Transamidation Assay for Determining Inhibitor Selectivity
IC50
17.0±n/a nM
Citation
 Hils, MPasternack, RBüchold, C Inhibitors of blood coagulation factor XIII US Patent  US11472838 Publication Date 10/18/2022 
Target
Name:
Protein-glutamine gamma-glutamyltransferase 6
Synonyms:
Protein-glutamine gamma-glutamyltransferase 6 TGM3L TGM6 TGase Y TGase-6 Transglutaminase-3-like Transglutaminase-6 (TG6)
Type:
Protein
Mol. Mass.:
79319.01
Organism:
Homo sapiens (Human)
Description:
Residue:
706
  
Inhibitor
Name:
BDBM577483
Synonyms:
US11472838, Compound 5
Type:
Small organic molecule
Emp. Form.:
C42H59N7O11
Mol. Mass.:
837.9582
SMILES:
COC(=O)\C=C\CC[C@H](NC(=O)c1ccncc1C(O)=O)C(=O)N[C@H](C(=O)N1CC(=O)C[C@H]1C(=O)N[C@@H](C1CCCCC1)C(=O)N[C@@H](C1CCCCC1)C(N)=O)C(C)(C)C
: