Target
Coagulation factor XIII A chain
Ligand
BDBM577534
Substrate
Meas. Tech.
Isopeptidase Assay for Estimating Inhibitor Potency
IC50
56.0±n/a nM
Citation
 Hils, MPasternack, RBüchold, C Inhibitors of blood coagulation factor XIII US Patent  US11472838 Publication Date 10/18/2022 
Target
Name:
Coagulation factor XIII A chain
Synonyms:
Coagulation factor XIII F13A1 | F13A_HUMAN
Type:
PROTEIN
Mol. Mass.:
83261.29
Organism:
Homo sapiens (Human)
Description:
ChEMBL_1475048
Residue:
732
  
Inhibitor
Name:
BDBM577534
Synonyms:
US11472838, Compound 42a/b
Type:
Small organic molecule
Emp. Form.:
C43H61N7O12
Mol. Mass.:
867.9841
SMILES:
CCOC(=O)\C=C\CC[C@H](NC(=O)c1ccc(cc1C(O)=O)[N+]([O-])=O)C(=O)N[C@H](C(=O)N1CC(=C)C[C@H]1C(=O)N[C@@H](CC(C)C)C(=O)N[C@@H](C1CCCCC1)C(N)=O)C(C)(C)C
: