Target
Prostaglandin E2 receptor EP4 subtype
Ligand
BDBM578748
Substrate
Meas. Tech.
EP4 Antagonistic Activity Measurement
IC50
1.70±n/a nM
Citation
 Asada, MTani, KHiguchi, S EP4 antagonist US Patent  US11479550 Publication Date 10/25/2022 
Target
Name:
Prostaglandin E2 receptor EP4 subtype
Synonyms:
PE2R4_HUMAN PGE2 receptor EP4 subtype PTGER4 Prostanoid EP4 receptor
Type:
Enzyme
Mol. Mass.:
53134.53
Organism:
Homo sapiens (Human)
Description:
P35408
Residue:
488
  
Inhibitor
Name:
BDBM578748
Synonyms:
US11479550, Example 3-7(2)
Type:
Small organic molecule
Emp. Form.:
C31H37N5O4
Mol. Mass.:
543.6566
SMILES:
CC(C)NC(=O)c1ccc2c(C)cn([C@H](C)C(=O)Nc3cc(Cn4cc(C)cn4)ccc3CCCC(O)=O)c2c1
: