Target
Prostaglandin E2 receptor EP4 subtype
Ligand
BDBM578769
Substrate
Meas. Tech.
EP4 Antagonistic Activity Measurement
IC50
0.570±n/a nM
Citation
 Asada, MTani, KHiguchi, S EP4 antagonist US Patent  US11479550 Publication Date 10/25/2022 
Target
Name:
Prostaglandin E2 receptor EP4 subtype
Synonyms:
PE2R4_HUMAN PGE2 receptor EP4 subtype PTGER4 Prostanoid EP4 receptor
Type:
Enzyme
Mol. Mass.:
53134.53
Organism:
Homo sapiens (Human)
Description:
P35408
Residue:
488
  
Inhibitor
Name:
BDBM578769
Synonyms:
US11479550, Example 11-15(2) | US11479550, Example 11-25(2)
Type:
Small organic molecule
Emp. Form.:
C27H30N4O5
Mol. Mass.:
490.5509
SMILES:
COCCNC(=O)c1ccc2c(C)cn([C@H](C)C(=O)Nc3cc(ccc3CCCC(O)=O)C#N)c2c1
: