Target
Presequence protease, mitochondrial
Ligand
BDBM581063
Substrate
Meas. Tech.
PREP Enzymatic Activity Assay
IC50
>10000±n/a nM
Citation
 Pujala, BPanpatil, DBernales, SBelmar, SUreta Díaz, GA Inhibitors of fibroblast activation protein US Patent  US11504364 Publication Date 11/22/2022 
Target
Name:
Presequence protease, mitochondrial
Synonyms:
Kiaa1104 PREP_MOUSE Pitrm1
Type:
Protein
Mol. Mass.:
117383.54
Organism:
Mouse
Description:
Q8K411
Residue:
1036
  
Inhibitor
Name:
BDBM581063
Synonyms:
US11504364, Compound 2
Type:
Small organic molecule
Emp. Form.:
C23H17ClF2N4O2
Mol. Mass.:
454.856
SMILES:
FC1(F)C[C@@H](C#N)N(C1)C(=O)CNC(=O)c1ccnc2ccc(cc12)-c1ccc(Cl)cc1
: