Target
Tyrosine-protein kinase JAK1
Ligand
BDBM584476
Substrate
Meas. Tech.
ADP-Glo Kinase Assay
IC50
<20±n/a nM
Citation
 Lee, HWJi, MKKim, SCYu, HNJung, SYPark, JLee, YLee, HKi, SYKim, DKim, M Heterocyclic compound as a protein kinase inhibitor US Patent  US11524968 Publication Date 12/13/2022 
Target
Name:
Tyrosine-protein kinase JAK1
Synonyms:
JAK-1 JAK1A JAK1_HUMAN Janus kinase 1 (JAK1) | Janus kinase 1 JAK1
Type:
Protein
Mol. Mass.:
133293.73
Organism:
Homo sapiens (Human)
Description:
P23458
Residue:
1154
  
Inhibitor
Name:
BDBM584476
Synonyms:
US11524968, Example 224
Type:
Small organic molecule
Emp. Form.:
C22H24FN5O3S
Mol. Mass.:
457.521
SMILES:
Fc1cc(ccc1NS(=O)(=O)N1CCCCC1)-c1cc(NC(=O)C2CC2)nc2[nH]ccc12
: