Target
Tyrosine-protein kinase JAK1
Ligand
BDBM584507
Substrate
Meas. Tech.
ADP-Glo Kinase Assay
IC50
<20±n/a nM
Citation
 Lee, HWJi, MKKim, SCYu, HNJung, SYPark, JLee, YLee, HKi, SYKim, DKim, M Heterocyclic compound as a protein kinase inhibitor US Patent  US11524968 Publication Date 12/13/2022 
Target
Name:
Tyrosine-protein kinase JAK1
Synonyms:
JAK-1 JAK1A JAK1_HUMAN Janus kinase 1 (JAK1) | Janus kinase 1 JAK1
Type:
Protein
Mol. Mass.:
133293.73
Organism:
Homo sapiens (Human)
Description:
P23458
Residue:
1154
  
Inhibitor
Name:
BDBM584507
Synonyms:
US11524968, Example 255
Type:
Small organic molecule
Emp. Form.:
C22H23N5O2
Mol. Mass.:
389.4503
SMILES:
O=C(CCC#N)N1C2CCC1C=C(C2)c1cc(NC(=O)C2CC2)nc2[nH]ccc12
: