Target
Sal-like protein 4
Ligand
BDBM585367
Substrate
Meas. Tech.
TBD
IC50
2231±n/a nM
Citation
 Qi, JVarca, AChai, L Small molecule inhibition of transcription factor SALL4 and uses thereof US Patent  US11530209 Publication Date 12/20/2022 
Target
Name:
Sal-like protein 4
Synonyms:
SALL4 ZNF797 Zinc finger protein SALL4
Type:
Protein
Mol. Mass.:
112246.17
Organism:
Human
Description:
Q9UJQ4
Residue:
1053
  
Inhibitor
Name:
BDBM585367
Synonyms:
US11530209, Compound A4
Type:
Small organic molecule
Emp. Form.:
C23H24N4O2
Mol. Mass.:
388.4623
SMILES:
Oc1ccc2ccccc2c1-c1nc2ccccn2c1NCCN1CCOCC1
: