Target
Sal-like protein 4
Ligand
BDBM585371
Substrate
Meas. Tech.
TBD
IC50
335±n/a nM
Citation
 Qi, JVarca, AChai, L Small molecule inhibition of transcription factor SALL4 and uses thereof US Patent  US11530209 Publication Date 12/20/2022 
Target
Name:
Sal-like protein 4
Synonyms:
SALL4 ZNF797 Zinc finger protein SALL4
Type:
Protein
Mol. Mass.:
112246.17
Organism:
Human
Description:
Q9UJQ4
Residue:
1053
  
Inhibitor
Name:
BDBM585371
Synonyms:
US11530209, Compound E1
Type:
Small organic molecule
Emp. Form.:
C19H16N4O
Mol. Mass.:
316.3565
SMILES:
Oc1ccc2ccccc2c1-c1nc2cnccn2c1NC1CC1
: