Target
Isoform PDE4B2 of cAMP-specific 3',5'-cyclic phosphodiesterase 4B
Ligand
BDBM589782
Substrate
Meas. Tech.
Cytokine Assays
IC50
0.350±n/a nM
Citation
 Strohbach, JWAkama, TBlakemore, DCJacobs, RTJones, PLimburg, DCOderinde, MSPerry, MAPlattner, JJTorella, RFZhou, YYeoh, TY Substituted 1,2-oxaborolan-2-ols as PDE4 inhibitors US Patent  US11559538 Publication Date 1/24/2023 
Target
Name:
Isoform PDE4B2 of cAMP-specific 3',5'-cyclic phosphodiesterase 4B (PDE4B2)
Synonyms:
DPDE4 PDE4B2 cAMP-specific 3',5'-cyclic phosphodiesterase 4B (PDE4B2) | phosphodiesterase 4B2
Type:
Enzyme
Mol. Mass.:
64320.36
Organism:
Homo sapiens (Human)
Description:
Q07343-2
Residue:
564
  
Inhibitor
Name:
BDBM589782
Synonyms:
US11559538, Example 42
Type:
Small organic molecule
Emp. Form.:
C20H22BNO4
Mol. Mass.:
351.204
SMILES:
CCCOc1c(OC)ccc(-c2cccc(c2)C2COB(O)C2)c1C#N
: