Target
Interferon gamma receptor 1
Ligand
BDBM589758
Substrate
IC50
0.600±n/a nM
Citation
 Strohbach, JWAkama, TBlakemore, DCJacobs, RTJones, PLimburg, DCOderinde, MSPerry, MAPlattner, JJTorella, RFZhou, YYeoh, TY Substituted 1,2-oxaborolan-2-ols as PDE4 inhibitors US Patent  US11559538 Publication Date 1/24/2023 
Target
Name:
Interferon gamma receptor 1
Synonyms:
CDw119 IFN-gamma-R-alpha IFNGR1 Interferon gamma receptor alpha-chain
Type:
Enzyme Catalytic Domain
Mol. Mass.:
54381.75
Organism:
Homo sapiens (Human)
Description:
P15260
Residue:
489
  
Inhibitor
Name:
BDBM589758
Synonyms:
US11559538, Example 189 US11559538, Example 53
Type:
Small organic molecule
Emp. Form.:
C18H22BNO4
Mol. Mass.:
327.183
SMILES:
CCOc1cc(ccc1OC)-c1cncc(C2COB(O)C2)c1C
: