Target
Isoform PDE4B2 of cAMP-specific 3',5'-cyclic phosphodiesterase 4B
Ligand
BDBM589895
Substrate
Meas. Tech.
Cytokine Assays
IC50
0.440±n/a nM
Citation
 Strohbach, JWAkama, TBlakemore, DCJacobs, RTJones, PLimburg, DCOderinde, MSPerry, MAPlattner, JJTorella, RFZhou, YYeoh, TY Substituted 1,2-oxaborolan-2-ols as PDE4 inhibitors US Patent  US11559538 Publication Date 1/24/2023 
Target
Name:
Isoform PDE4B2 of cAMP-specific 3',5'-cyclic phosphodiesterase 4B (PDE4B2)
Synonyms:
DPDE4 PDE4B2 cAMP-specific 3',5'-cyclic phosphodiesterase 4B (PDE4B2) | phosphodiesterase 4B2
Type:
Enzyme
Mol. Mass.:
64320.36
Organism:
Homo sapiens (Human)
Description:
Q07343-2
Residue:
564
  
Inhibitor
Name:
BDBM589895
Synonyms:
US11559538, Example 147 | US11559538, Example 148
Type:
Small organic molecule
Emp. Form.:
C15H19BN2O4S
Mol. Mass.:
334.198
SMILES:
CCCOc1cc(ccc1OC)-c1nc(ns1)C1COB(O)C1
: