Target
Proteinase-activated receptor 4
Ligand
BDBM175978
Substrate
Meas. Tech.
FLIPR Assay
Temperature
298.15±n/a K
EC50
1.30±n/a nM
Comments
extracted
Citation
 Banville, JRémillard, RRuediger, EHDeon, DHGagnon, MDubé, LGuy, JPriestley, ESPosy, SLMaxwell, BDWong, PCLawrence, RMMiller, MM Imidazothiadiazole and imidazopyrazine derivatives as protease activated receptor 4 (PAR4) inhibitors for treating platelet aggregation US Patent  US9688695 Publication Date 6/27/2017 
Target
Name:
Proteinase-activated receptor 4
Synonyms:
Coagulation factor II receptor-like 3 PAR-4 PAR4_HUMAN Proteinase-activated receptor 4 (PAR4) | Thrombin receptor-like 3
Type:
Protein
Mol. Mass.:
41145.16
Organism:
Homo sapiens (Human)
Description:
Q96RI0
Residue:
385
  
Inhibitor
Name:
BDBM175978
Synonyms:
US10047103, 11 | US9688695, 11
Type:
Small organic molecule
Emp. Form.:
C25H17F3N4O4S2
Mol. Mass.:
558.552
SMILES:
COc1nn2cc(nc2s1)-c1cc2c(OCc3csc(n3)-c3ccc(cc3)C(F)(F)F)cc(OC)cc2o1
: