Target
Proteinase-activated receptor 4
Ligand
BDBM175988
Substrate
Meas. Tech.
FLIPR Assay
Temperature
298.15±n/a K
EC50
0.43±n/a nM
Comments
extracted
Citation
 Banville, JRémillard, RRuediger, EHDeon, DHGagnon, MDubé, LGuy, JPriestley, ESPosy, SLMaxwell, BDWong, PCLawrence, RMMiller, MM Imidazothiadiazole and imidazopyrazine derivatives as protease activated receptor 4 (PAR4) inhibitors for treating platelet aggregation US Patent  US9688695 Publication Date 6/27/2017 
Target
Name:
Proteinase-activated receptor 4
Synonyms:
Coagulation factor II receptor-like 3 PAR-4 PAR4_HUMAN Proteinase-activated receptor 4 (PAR4) | Thrombin receptor-like 3
Type:
Protein
Mol. Mass.:
41145.16
Organism:
Homo sapiens (Human)
Description:
Q96RI0
Residue:
385
  
Inhibitor
Name:
BDBM175988
Synonyms:
US10047103, 21 | US9688695, 21
Type:
Small organic molecule
Emp. Form.:
C23H23N5O4S2
Mol. Mass.:
497.59
SMILES:
COc1nn2cc(nc2s1)-c1cc2c(OCc3csc(n3)N3CCCCC3)cc(OC)cc2o1
: