Target
Prostaglandin E2 receptor EP2 subtype
Ligand
BDBM179998
Substrate
Meas. Tech.
Binding Assay
pH
6±n/a
Ki
0.79±n/a nM
Comments
extracted
Citation
 Shibakawa, NYoneda, KKatsube, TKanda, TIto, KYamamoto, KIwase, NUshiyama, S Substituted biaryl compound US Patent  US9676720 Publication Date 6/13/2017 
Target
Name:
Prostaglandin E2 receptor EP2 subtype
Synonyms:
PE2R2_HUMAN PTGER2 Prostaglandin E2 receptor Prostanoid EP2 Receptor
Type:
Enzyme
Mol. Mass.:
39775.71
Organism:
Homo sapiens (Human)
Description:
P43116
Residue:
358
  
Inhibitor
Name:
BDBM179998
Synonyms:
US9676720, Example 11
Type:
Small organic molecule
Emp. Form.:
C27H27N3O5S2
Mol. Mass.:
537.65
SMILES:
CCOc1cccc(c1)-c1ccc(CN(Cc2cccc(NCC(O)=O)n2)S(=O)(=O)c2cccs2)cc1
: