Target
Carboxylic ester hydrolase
Ligand
BDBM10458
Substrate
BDBM8978
Meas. Tech.
Enzyme Inhibition Assay
IC50
>500000±n/a nM
Citation
 Han, YFLi, CPChow, EWang, HPang, YPCarlier, PR Dual-site binding of bivalent 4-aminopyridine- and 4-aminoquinoline-based AChE inhibitors: contribution of the hydrophobic alkylene tether to monomer and dimer affinities. Bioorg Med Chem 7:2569-75 (1999)  
Target
Name:
Carboxylic ester hydrolase
Synonyms:
Acetylcholinesterase and butyrylcholinesterase (AChE and BChE) Butyrylcholinesterase (BuChE) | butyrylcholinesterase precursor
Type:
Enzyme
Mol. Mass.:
67776.22
Organism:
Rattus norvegicus (rat)
Description:
Residue:
597
  
Inhibitor
Name:
BDBM10458
Synonyms:
4-AP CHEMBL284348 pyridin-4-amine
Type:
Small organic molecule
Emp. Form.:
C5H6N2
Mol. Mass.:
94.1145
SMILES:
Nc1ccncc1
:
Substrate
Name:
BDBM8978
Synonyms:
(Propylcarbonylthioethyl)trimethylammonium iodide CHEMBL148530 butyrylthiocholine | butyrylthiocholine chloride
Type:
Small organic molecule
Emp. Form.:
C9H20NOS
Mol. Mass.:
190.326
SMILES:
CCCC(=O)SCC[N+](C)(C)C
: