Target
Orexin/Hypocretin receptor type 1
Ligand
BDBM175170
Substrate
Meas. Tech.
Receptor Radioligand Binding Studies
Ki
25.0±n/a nM
Citation
 Coate, HRDvorak, CAPreville, CShireman, BT Substituted piperidine compounds and their use as orexin receptor modulators US Patent  US9611251 Publication Date 4/4/2017 
Target
Name:
Orexin/Hypocretin receptor type 1
Synonyms:
HCRTR1 OX1R_HUMAN Orexin receptor type 1 (OR 1) Orexin receptor type 1 (OX1) Orexin receptor type 1 (OxR1) | Ox1r
Type:
Protein
Mol. Mass.:
47554.50
Organism:
Homo sapiens (Human)
Description:
O43613
Residue:
425
  
Inhibitor
Name:
BDBM175170
Synonyms:
US9115117, 94 | US9611251, 94
Type:
Small organic molecule
Emp. Form.:
C20H21F3N8O
Mol. Mass.:
446.4289
SMILES:
C[C@H]1[C@@H](CCCN1C(=O)c1ncc(C)cc1-n1nccn1)Nc1ncc(cn1)C(F)(F)F
: