Target
Orexin/Hypocretin receptor type 1
Ligand
BDBM143778
Substrate
Meas. Tech.
Radioligand Binding Assay
Ki
132±n/a nM
Citation
 Gelin, CFLebold, TPShireman, BTZiff, JM Substituted 2-azabicycles and their use as orexin receptor modulators US Patent  US9611277 Publication Date 4/4/2017 
Target
Name:
Orexin/Hypocretin receptor type 1
Synonyms:
Hcrtr1 OX1R_RAT Orexin receptor type 1 (OX1R) Ox1-R | Ox1R
Type:
Protein
Mol. Mass.:
46817.55
Organism:
Rattus norvegicus (Rat)
Description:
P56718
Residue:
416
  
Inhibitor
Name:
BDBM143778
Synonyms:
US10183953, Example 39 US9611277, Example 39 | US9845333, 39
Type:
Small organic molecule
Emp. Form.:
C23H21F3N4O3
Mol. Mass.:
458.433
SMILES:
COc1cccc(-c2ccn[nH]2)c1C(=O)N1CC2CC(Oc3ccc(cn3)C(F)(F)F)C1C2
: