Target
Cell division cycle 7-related protein kinase [58-574]/Protein DBF4 homolog A
Ligand
BDBM50329415
Substrate
Meas. Tech.
Inhibition Assay of Cdc7 Activity
IC50
<100±n/a nM
Citation
 Vanotti, ECaldarelli, MCirla, AForte, BErmoli, AMenichincheri, MPillan, AScolaro, A Pyridyl-and pyrimidinyl-substituted pyrrole-, thiophene- and furane-derivatives as kinase inhibitors US Patent  US9670191 Publication Date 6/6/2017 
Target
Name:
Cell division cycle 7-related protein kinase [58-574]/Protein DBF4 homolog A
Synonyms:
Cdc7 Kinase | Cdc7/DBF4
Type:
Protein Complex
Mol. Mass.:
Description:
Components:
This complex has 2 components.
Component 1
Name:
Cell division cycle 7-related protein kinase [58-574]
Synonyms:
CDC7 CDC7_HUMAN Cell division cycle 7-related protein kinase
Type:
Serine/threonine-protein kinase
Mol. Mass.:
57470.88
Organism:
Homo sapiens (Human)
Description:
O00311[58-574]
Residue:
517
  
Component 2
Name:
Protein DBF4 homolog A
Synonyms:
ASK Chiffon homolog A DBF4-type zinc finger-containing protein 1 DBF4A_HUMAN ZDBF1
Type:
Regulatory subunit
Mol. Mass.:
76869.65
Organism:
Homo sapiens (Human)
Description:
Residue:
674
  
Inhibitor
Name:
BDBM50329415
Synonyms:
2-(4-Fluoro-phenyl)-5-pyridin-4-yl-1H-pyrrole-3-carboxamide US9670191, A4
Type:
Small organic molecule
Emp. Form.:
C16H12FN3O
Mol. Mass.:
281.2844
SMILES:
NC(=O)c1cc([nH]c1-c1ccc(F)cc1)-c1ccncc1
: