Target
D(2) dopamine receptor
Ligand
BDBM319696
Substrate
Meas. Tech.
D2 Receptor Agonism Activity Test
IC50
0.092±n/a nM
Citation
 Jiang, HWang, ZLi, JZhang, RHe, YLiu, YBi, MLiu, ZTian, GChen, WYang, FWu, CWang, YJiang, XYin, JWang, GShen, J Heterocyclic compounds, process for preparation of the same and use thereof US Patent  US10174011 Publication Date 1/8/2019 
Target
Name:
D(2) dopamine receptor
Synonyms:
D(2) dopamine receptor DOPAMINE D2 Long DRD2 Dopamine D2 receptor Dopamine D2 receptor (D2R) Dopamine2-like | d2
Type:
Cell-surface receptors
Mol. Mass.:
50647.10
Organism:
Homo sapiens (Human)
Description:
P14416
Residue:
443
  
Inhibitor
Name:
BDBM319696
Synonyms:
6-(2-(4-(2-fluorobenzo[b]thiophen-4-yl)piperazin-1-yl)ethyl)-3,4-dihydroquinolin-2(1H)-one | US10174011, Example 65
Type:
Small organic molecule
Emp. Form.:
C23H24FN3OS
Mol. Mass.:
409.52
SMILES:
Fc1cc2c(cccc2s1)N1CCN(CCc2ccc3NC(=O)CCc3c2)CC1
: