Target
Phosphodiesterase
Ligand
BDBM320766
Substrate
Meas. Tech.
Lab B PDE2 assay
Ki
0.096±n/a nM
Citation
 Shen, DDwyer, MPSinz, CJWang, DStachel, SJPaone, DVForster, ABerger, RChen, YQian, YXu, SHu, C Dihydropyrazolopyrimidinone compounds as PDE2 inhibitors US Patent  US10174037 Publication Date 1/8/2019 
Target
Name:
Phosphodiesterase
Synonyms:
PDE2A
Type:
Enzyme Catalytic Domain
Mol. Mass.:
105104.20
Organism:
Macaca mulatta (Rhesus macaque)
Description:
Residue:
935
  
Inhibitor
Name:
BDBM320766
Synonyms:
(R)- or (S)-6-(Dimethylamino)-3- (fluoromethyl)-1-(1-(4- (trifluoromethyl)phenyl)propyl)-1H- pyrazolo[3,4-d]pyrimidin-4(5H)-one US10174037, Example 173
Type:
Small organic molecule
Emp. Form.:
C18H19F4N5O
Mol. Mass.:
397.37
SMILES:
CCC(c1ccc(cc1)C(F)(F)F)n1nc(CF)c2c1nc([nH]c2=O)N(C)C
: