Target
P2X purinoceptor 2
Ligand
BDBM319940
Substrate
Meas. Tech.
Intracellular Calcium Measurement to Assess Antagonist Activity at Human P2X3 and Human P2X2/3 Receptors
IC50
17.0±n/a nM
Citation
 Davenport, AJBräuer, NFischer, OMRotgeri, ARottmann, ANeagoe, INagel, JGodinho-Coelho, AKlar, J 1,3-thiazol-2-yl substituted benzamides US Patent  US10183937 Publication Date 1/22/2019 
Target
Name:
P2X purinoceptor 2
Synonyms:
ATP receptor P2RX2_HUMAN Purinergic receptor | PurinergicP2X2/3
Type:
Enzyme Catalytic Domain
Mol. Mass.:
51765.18
Organism:
Homo sapiens (Human)
Description:
PurinergicP2X2/3 0 HUMAN::Q9UBL9
Residue:
471
  
Inhibitor
Name:
BDBM319940
Synonyms:
N-[(1R)-1-(6- Methylpyridin- 3-yl)ethyl]- 3-[(2- methylpyridin- 4-yl)oxy]-5- (5-methyl- 1,3-thiazol-2- yl)benzamide US10202369, Example 107 | US10472354, Example 107
Type:
Small organic molecule
Emp. Form.:
C25H24N4O2S
Mol. Mass.:
444.549
SMILES:
C[C@@H](NC(=O)c1cc(Oc2ccnc(C)c2)cc(c1)-c1ncc(C)s1)c1ccc(C)nc1
: