Target
Orexin receptor type 2
Ligand
BDBM143778
Substrate
Meas. Tech.
Human Orexin 2 Receptor Ca2+ Mobilization Assay
Ki
108±n/a nM
Citation
 Gelin, CFLebold, TPShireman, BTZiff, JM Substituted 2-azabicycles and their use as orexin receptor modulators US Patent  US10183953 Publication Date 1/22/2019 
Target
Name:
Orexin receptor type 2
Synonyms:
HCRTR2 OX2R_HUMAN Orexin receptor type 2 (OR-2) Orexin receptor type 2 (OX2R) Ox-2-R | Ox2-R
Type:
Protein
Mol. Mass.:
50710.53
Organism:
Homo sapiens (Human)
Description:
O43614
Residue:
444
  
Inhibitor
Name:
BDBM143778
Synonyms:
US10183953, Example 39 US9611277, Example 39 | US9845333, 39
Type:
Small organic molecule
Emp. Form.:
C23H21F3N4O3
Mol. Mass.:
458.433
SMILES:
COc1cccc(-c2ccn[nH]2)c1C(=O)N1CC2CC(Oc3ccc(cn3)C(F)(F)F)C1C2
: