Target
Orexin receptor type 2
Ligand
BDBM164112
Substrate
Meas. Tech.
Human Orexin 2 Receptor Radioligand Binding Assay
Ki
239±n/a nM
Citation
 Coate, HRDvorak, CAFitzgerald, AELebold, TPPreville, CShireman, BT Substituted 7-azabicycles and their use as orexin receptor modulators US Patent  US9637496 Publication Date 5/2/2017 
Target
Name:
Orexin receptor type 2
Synonyms:
HCRTR2 OX2R_HUMAN Orexin receptor type 2 (OR-2) Orexin receptor type 2 (OX2R) Ox-2-R | Ox2-R
Type:
Protein
Mol. Mass.:
50710.53
Organism:
Homo sapiens (Human)
Description:
O43614
Residue:
444
  
Inhibitor
Name:
BDBM164112
Synonyms:
US9062078, 242 US9637496, 242 | US9695183, 242
Type:
Small organic molecule
Emp. Form.:
C21H20F3N7O2
Mol. Mass.:
459.4244
SMILES:
COc1cccc(c1C(=O)N1C2CCC1C(C2)Nc1cnc(cn1)C(F)(F)F)-n1nccn1
: