Target
Nuclear receptor ROR-gamma
Ligand
BDBM329650
Substrate
Meas. Tech.
Binding Assay
Ki
<100±n/a nM
Citation
 Claremon, DADillard, LWDong, CFan, YLotesta, SDMarcus, ASingh, SBTice, CMYuan, JZhao, WZhuang, L Dihydropyrrolopyridine inhibitors of ROR-gamma US Patent  US9663515 Publication Date 5/30/2017 
Target
Name:
Nuclear receptor ROR-gamma
Synonyms:
NR1F3 Nuclear receptor ROR-gamma (RORC) RAR-related orphan receptor C (RORc) RORG RZRG Retinoid-related orphan receptor-gamma (RORc)
Type:
Enzyme Catalytic Domain
Mol. Mass.:
58218.40
Organism:
Homo sapiens (Human)
Description:
P51449
Residue:
518
  
Inhibitor
Name:
BDBM329650
Synonyms:
US11001583, Compound 6 | US9663515, Compound 6
Type:
Small organic molecule
Emp. Form.:
C28H36F3N3O5S
Mol. Mass.:
583.663
SMILES:
CC[C@@H]1N(C[C@H]2CC[C@H](OC2)C(F)(F)F)Cc2cc(cnc12)C(=O)N[C@@H](COC)c1ccc(cc1)S(=O)(=O)CC
: