Target
Orexin receptor type 2
Ligand
BDBM334973
Substrate
Meas. Tech.
Inhibition Assay
IC50
3.00±n/a nM
Citation
 Boss, CBrotschi, CGude, MHeidmann, BSifferlen, TWilliams, J Benzimidazole-proline derivatives US Patent  US9732075 Publication Date 8/15/2017 
Target
Name:
Orexin receptor type 2
Synonyms:
HCRTR2 OX2R_HUMAN Orexin receptor type 2 (OR-2) Orexin receptor type 2 (OX2R) Ox-2-R | Ox2-R
Type:
Protein
Mol. Mass.:
50710.53
Organism:
Homo sapiens (Human)
Description:
O43614
Residue:
444
  
Inhibitor
Name:
BDBM334973
Synonyms:
US11040966, Example 5.36 US9914721, Ex. 7 | [(S)-2-(5-Chloro-4-methyl-1H-benzoimidazol-2-yl)-2-methyl-pyrrolidin-1-yl]-(5-methoxy-2-[1,2,3]triazol-2-yl-phenyl)-methanone
Type:
Small organic molecule
Emp. Form.:
C23H23ClN6O2
Mol. Mass.:
450.921
SMILES:
COc1ccc(c(c1)C(=O)N1CCC[C@@]1(C)c1nc2c(C)c(Cl)ccc2[nH]1)-n1nccn1
: