Target
Epidermal growth factor receptor [T790M,L858R]
Ligand
BDBM200499
Substrate
Meas. Tech.
TBD
IC50
0.540±n/a nM
Citation
 Zhou, CZhang, G Fused tricyclic amide compounds as multiple kinase inhibitors US Patent  US9670231 Publication Date 6/6/2017 
Target
Name:
Epidermal growth factor receptor [T790M,L858R]
Synonyms:
EGFR EGFR_HUMAN ERBB1 Epidermal growth factor receptor (EGFR)(T790M/L858R) Epidermal growth factor receptor (T790M, L858R) Epidermal growth factor receptor(L858R, T790M) | HER1
Type:
Mol. Mass.:
134353.72
Organism:
Homo sapiens (Human)
Description:
P00533[T790M,L858R]
Residue:
1210
  
Inhibitor
Name:
BDBM200499
Synonyms:
US9670231, 1.27
Type:
Small organic molecule
Emp. Form.:
C30H28F3N5O4
Mol. Mass.:
579.5696
SMILES:
FC(F)(F)c1cc(ccc1CN1CCNCC1)C(=O)N[C@@H]1[C@H]2Oc3ccc(Oc4ccnc5NC(=O)CCc45)cc3[C@@H]12
: