Target
Dimer of Gag-Pol polyprotein [489-587,K509R,V521I,L522F,M525I,L552P,A560V,V571A,L579M]
Ligand
BDBM518
Substrate
HIV Protease Chromogenic Peptide Substrate
Meas. Tech.
Protease Inhibition Assay
pH
4.7±n/a
Temperature
310.15±n/a K
Ki
17±3 nM
Km
47000±5000 nM
Comments
kcat/Km=0.58 +/-0.07 uM-1sec-1
Citation
 Clemente, JCMoose, REHemrajani, RWhitford, LRGovindasamy, LReutzel, RMcKenna, RAgbandje-McKenna, MGoodenow, MMDunn, BM Comparing the accumulation of active- and nonactive-site mutations in the HIV-1 protease. Biochemistry 43:12141-51 (2004)  
Target
Name:
Dimer of Gag-Pol polyprotein [489-587,K509R,V521I,L522F,M525I,L552P,A560V,V571A,L579M]
Synonyms:
HIV-1 Protease Mutant V6 The post-ritonavir therapy protease variant
Type:
Protein Complex
Mol. Mass.:
Description:
The HIV-1 PR DNA for all of the HIV LAI variants was cloned, and protein was expressed, purified, and refolded from Escherichia coli strain BL21.
Components:
This complex has 2 components.
Component 1
Name:
Gag-Pol polyprotein [489-587,K509R,V521I,L522F,M525I,L552P,A560V,V571A,L579M]
Synonyms:
HIV-1 Protease Mutant V6 chain A POL_HV1H2 | gag-pol
Type:
Enzyme Subunit
Mol. Mass.:
10841.17
Organism:
Human immunodeficiency virus type 1
Description:
P04585[489-587,K509R,V521I,L522F,M525I,L552P,A560V,V571A,L579M]
Residue:
99
  
Component 2
Name:
Gag-Pol polyprotein [489-587,K509R,V521I,L522F,M525I,L552P,A560V,V571A,L579M]
Synonyms:
HIV-1 Protease Mutant V6 chain A POL_HV1H2 | gag-pol
Type:
Enzyme Subunit
Mol. Mass.:
10841.17
Organism:
Human immunodeficiency virus type 1
Description:
P04585[489-587,K509R,V521I,L522F,M525I,L552P,A560V,V571A,L579M]
Residue:
99
  
Inhibitor
Name:
BDBM518
Synonyms:
(3S,4aS,8aS)-N-tert-butyl-2-[(2R,3R)-2-hydroxy-3-[(3-hydroxy-2-methylphenyl)formamido]-4-(phenylsulfanyl)butyl]-decahydroisoquinoline-3-carboxamide CHEMBL584 Viracept
Type:
Small organic molecule
Emp. Form.:
C32H45N3O4S
Mol. Mass.:
567.782
SMILES:
Cc1c(O)cccc1C(=O)N[C@@H](CSc1ccccc1)[C@H](O)CN1C[C@H]2CCCC[C@H]2C[C@H]1C(=O)NC(C)(C)C
:
Substrate
Name:
HIV Protease Chromogenic Peptide Substrate
Synonyms:
Type:
Peptide
Mol. Mass.:
1420.11
Organism:
Description:
Residue:
13
KARVLNPHEANLG