Target
Cyclin-A2/Cyclin-dependent kinase 2
Ligand
BDBM253921
Substrate
Meas. Tech.
Caliper Assay
IC50
1410±n/a nM
Citation
 Strum, JCBisi, JERoberts, PJTavares, FX HSPC-sparing treatments for RB-positive abnormal cellular proliferation US Patent  US9527857 Publication Date 12/27/2016 
Target
Name:
Cyclin-A2/Cyclin-dependent kinase 2
Synonyms:
CDK2-CyclinA CDK2/Cyclin A Cyclin A2/dependent kinase 2 Cyclin-Dependent Kinase 2 (CDK2A)
Type:
Protein Complex
Mol. Mass.:
Description:
Cdk2/Cyclin A kinase was purified from insect cells coinfected with Cyclin A/Cdk2 baculovirus.
Components:
This complex has 2 components.
Component 1
Name:
Cyclin-dependent kinase 2
Synonyms:
CDK2 CDK2_HUMAN Cell division protein kinase 2 Protein cereblon/Cyclin-dependent kinase 2 | p33 protein kinase
Type:
Enzyme Subunit
Mol. Mass.:
33938.17
Organism:
Homo sapiens (Human)
Description:
P24941
Residue:
298
  
Component 2
Name:
Cyclin-A2
Synonyms:
CCN1 CCNA1 CCNA2_HUMAN Cyclin-A
Type:
Enzyme Subunit
Mol. Mass.:
48550.19
Organism:
Homo sapiens (Human)
Description:
P20248
Residue:
432
  
Inhibitor
Name:
BDBM253921
Synonyms:
US9464092, M | US9527857, M
Type:
Small organic molecule
Emp. Form.:
C30H42N8O
Mol. Mass.:
530.7075
SMILES:
C[C@H]1CN(CCN1CCC(C)(C)C)c1ccc(Nc2ncc3cc4C(=O)NCC5(CCCCC5)n4c3n2)nc1
: