Target
cGMP-specific 3',5'-cyclic phosphodiesterase
Ligand
BDBM14398
Substrate
BDBM14391
Meas. Tech.
PDE Enzyme Inhibitor Assays
pH
7.4±n/a
Temperature
303.15±n/a K
IC50
2.7±n/a nM
Comments
cGMP in a 3:1 ratio unlabeled to 3H-labeled at a concentration 1/3Km, such that IC50 = Ki.
Citation
 Allerton, CMBarber, CGBeaumont, KCBrown, DGCole, SMEllis, DLane, CAMaw, GNMount, NMRawson, DJRobinson, CMStreet, SDSummerhill, NW A novel series of potent and selective PDE5 inhibitors with potential for high and dose-independent oral bioavailability. J Med Chem 49:3581-94 (2006)  
Target
Name:
cGMP-specific 3',5'-cyclic phosphodiesterase
Synonyms:
3',5'-cyclic phosphodiesterase PDE5 PDE5A_HUMAN Phosphodiesterase 5 (PDE5) Phosphodiesterase 5A (PDE5A) cGMP-specific 3',5'-cyclic phosphodiesterase
Type:
Protein
Mol. Mass.:
99975.83
Organism:
Homo sapiens (Human)
Description:
O76074
Residue:
875
  
Inhibitor
Name:
BDBM14398
Synonyms:
5-(5-Acetyl-2-propoxy-3-pyridinyl)-3-ethyl-2-[(1-methyl-1H-imidazol-2-yl)methyl]-2,6-dihydro-7H-pyrazolo[4,3-d]pyrimidin-7-one Sildenafil 5-methyl ketone analogue 48
Type:
Small organic molecule
Emp. Form.:
C22H25N7O3
Mol. Mass.:
435.479
SMILES:
CCCOc1ncc(cc1-c1nc2c(CC)n(Cc3nccn3C)nc2c(=O)[nH]1)C(C)=O
:
Substrate
Name:
BDBM14391
Synonyms:
2-amino-9-[(4aR,6R,7R,7aS)-2,7-dihydroxy-2-oxidotetrahydro-4H-furo[3,2-d][1,3,2]dioxaphosphinin-6-yl]-1,9-dihydro-6H-purin-6-one GUANOSINE-3 ,5 -MONOPHOSPHATE cGMP
Type:
Nucleoside or nucleotide
Emp. Form.:
C10H12N5O7P
Mol. Mass.:
345.2053
SMILES:
Nc1nc2n(cnc2c(=O)[nH]1)[C@@H]1O[C@@H]2COP(O)(=O)O[C@H]2[C@H]1O
: