Target
Carbonic anhydrase 2
Ligand
BDBM14721
Substrate
BDBM11326
Meas. Tech.
Esterase Assay
Ki
3.13±n/a nM
Citation
 Casey, JRMorgan, PEVullo, DScozzafava, AMastrolorenzo, ASupuran, CT Carbonic anhydrase inhibitors. Design of selective, membrane-impermeant inhibitors targeting the human tumor-associated isozyme IX. J Med Chem 47:2337-47 (2004)  
Target
Name:
Carbonic anhydrase 2
Synonyms:
CA-II CAC Carbonate dehydratase II Carbonic anhydrase 2 (CA-II) Carbonic anhydrase C Carbonic anhydrase II (CA-II) Carbonic anhydrase II (hCA II) | Carbonic anhydrase isoenzyme II (hCA II)
Type:
Enzyme
Mol. Mass.:
29250.71
Organism:
Homo sapiens (Human)
Description:
P00918
Residue:
260
  
Inhibitor
Name:
BDBM14721
Synonyms:
2,6-di-tert-butyl-4-methyl-1-{4-[(5-sulfamoyl-1,3,4-thiadiazol-2-yl)sulfamoyl]phenyl}-1-pyridin-1-ylium perchlorate | pyridinium-containing sulfonamide analog 14d
Type:
Small organic molecule
Emp. Form.:
C22H30N5O4S3
Mol. Mass.:
524.699
SMILES:
Cc1cc([n+](-c2ccc(cc2)S(=O)(=O)Nc2nnc(s2)S(N)(=O)=O)c(c1)C(C)(C)C)C(C)(C)C
:
Substrate
Name:
BDBM11326
Synonyms:
4-nitrophenyl acetate | p-Nitrophenyl Acetate
Type:
Small organic molecule
Emp. Form.:
C8H7NO4
Mol. Mass.:
181.1455
SMILES:
CC(=O)Oc1ccc(cc1)[N+]([O-])=O
: